Works (Password 12345678) but still blocking

1 job for archive/experimental/autoconnect in 1 minute and 24 seconds (queued for 3 seconds)
latest
Status Name Job ID Coverage
  Build
failed job #13428

00:01:24

 
Name Stage Failure
failed
job Build
========================= [FAILED] Took 30.16 seconds =========================

Environment Status Duration
------------- -------- ------------
esp8266 FAILED 00:00:32.935
esp32 FAILED 00:00:30.162
==================== 2 failed, 0 succeeded in 00:01:03.098 ====================
Cleaning up file based variables
ERROR: Job failed: exit code 1