Broken

1 job for archive/experimental/save_config in 1 minute and 18 seconds (queued for 3 minutes and 43 seconds)
latest
Status Name Job ID Coverage
  Build
failed job #13436

00:01:18

 
Name Stage Failure
failed
job Build
========================= [FAILED] Took 28.84 seconds =========================

Environment Status Duration
------------- -------- ------------
esp8266 FAILED 00:00:28.147
esp32 FAILED 00:00:28.845
==================== 2 failed, 0 succeeded in 00:00:56.992 ====================
Cleaning up file based variables
ERROR: Job failed: exit code 1